{"text_format":"1","workbook":"xlsx","n_sheets":7,"sheets":["Welcome","Model Guide","1. Project Dashboard","2. Model Assumptions","3. Input Sheet ","4. Output Sheet","5. Notes"],"not_rendered":{"charts":0,"images":2,"macros":1,"external_links":1,"defined_names":224,"comments":1,"pivot_tables":0},"unopened":[],"bounds":{"document_bytes":16777216,"sheet_cells":100000,"rows_first":2000,"rows_last":500,"rows_between":2000,"halvings":0,"cell_chars":16384,"cell_head_chars":4096},"cells_cut":0,"cells_raw":0,"read":"whole","date_system":"1900"}

{"sheet":"Welcome","index":0,"n_rows":42,"n_cols":8,"rows_kept":42,"cut":false,"hidden":false,"merged":[[7,2,8,13],[10,2,10,13]]}
[]
[]
[]
[]
[]
[null,"Support Services Investment Appraisal Model Guide "]
[]
[null,"Model Description","To assess the viability of a Support Services project and the value it generates. In the context of a business case, the primary objective of investment appraisal is to place a value on benefits so that the costs are justified."]
[]
[]
[null,null,"This Model is primarily designed for Support Services projects and has been designed to evaluate the financial benefits of a single construction or refurbishment project."]
[]
[null,null,"This includes the following areas:"]
[null,null,"- Accommodation ",null,null,null,"- ICT"]
[null,null,"- Advancement ",null,null,null,"- Offices "]
[null,null,"- Careers ",null,null,null,"- Library "]
[null,null,"- Catering ",null,null,null,"- Registry "]
[null,null,"- Conferences & Events",null,null,null,"- Research Office "]
[null,null,"- Early Years Education Centre",null,null,null,"- Student HUB"]
[null,null,"- Estates Facilities/Projects",null,null,null,"- Sports"]
[null,null,"- Human Resources "]
[]
[]
[null,"Instructions for use","See Model Guide "]
[null,null,"Enter scenarios on the Inputs page"]
[]
[null,"Input Sources","Judgement "]
[]
[null,"Colour codes",1,null,"An input cell",null,"NB Uses Cell styles"]
[]
{"$rows_left_out":13}
{"sheet":"Model Guide","index":1,"n_rows":82,"n_cols":5,"rows_kept":82,"cut":false,"hidden":false,"merged":[[24,4,24,25]]}
[]
[]
[]
[]
[]
[null,"Support Services Investment Appraisal Model Guide "]
[]
[null,"The Model will forecast a summary Income and Expenditure Statement (excluding depreciation), and uses the following capital appraisal measures:"]
[null,null,"- Net Present Value"]
[null,null,"- Internal Rate of Return"]
[null,null,"- Modified Internal Rate of Return"]
[null,null,"- Payback Period"]
[]
[null,"Please do not insert any rows in the Inputs Tab",null,"Please enter all income as negative and expenses as positive. "]
[null,"Please enter all amounts in £'000s"]
[null,"The Model can produce NPVs over a 50 year duration."]
[]
[null,"The year of construction cannot begin from more than two years than the current year. The longest construction period is three years. "]
[]
[null,"USER INPUTS AND COMPLETING THE MODEL "]
[]
[null,"The template is structured across several tabs as follows:"]
[null,null,"Tab Name:",null,"Description:"]
[]
[null,null,"1. Project Dashboard",null,"This sheet contains the variables, which are applied to the inputs. It highlights key outputs of the investment modelled scenario against sensitivities applied. It compares the outputs of the scenarios which are generated by the sensitivities inserted in the input sheet. \nChanges in this sheet should be justified in 6.Notes"]
[null,null,"2. Model Assumptions",null,"This sheet is where the general assumption inputs are inputted. This includes the start year of construction, duration and fixed rates which should not be altered. You should only complete the cells which are shaded green."]
[null,null,"3. Input Sheet ",null,"This sheet is where all estimates relating to expected costs and associated income should be entered. You should only complete the cells which are shaded green. "]
[null,null,"4. Output Sheet",null,"This sheet converts the inputs into summarised Income and Expenditure for a project with the cash flow data based on certain criteria with the use of the investment appraisal techniques. "]
[null,null,"5. Notes",null,"This sheet is for additional information or calculations."]
[]
{"$rows_left_out":53}
{"sheet":"1. Project Dashboard","index":2,"n_rows":31,"n_cols":10,"rows_kept":31,"cut":false,"hidden":false,"merged":[]}
[]
[null,{"$f":"NameofProject&\" appraisal - PROJECT DASHBOARD\"","v":"Investment A appraisal - PROJECT DASHBOARD"}]
[null,null,null,null,null,null,null,"Project Approval Process"]
[null,"Summary of Options"]
[null,null,{"$f":"NameofProject","v":"Investment A"},{"$f":"NameofProject","v":"Investment A"},{"$f":"NameofProject","v":"Investment A"},null,null,"Project Threshold","Project Board Approval","Minimum Investment Appraisal"]
[null,null,{"$f":"'3. Input Sheet '!H5","v":"Base Case"},{"$f":"'3. Input Sheet '!I5","v":"Upper Case"},{"$f":"'3. Input Sheet '!J5","v":"Lower Case"},null,null,"Above £150k-£1m","PRM Board","Discounted Payback Period"]
[null,"Key metrics (£)",null,null,null,null,null,"£1m-£10m","Resource Allocation Board","Discounted Payback Period, NPV, IRR & MIRR"]
[null,"Initial capital cost",{"$f":"Total_capital_Base","v":-1064216.9392717455},{"$f":"Total_capital_upper","v":-526031.84182128904},{"$f":"Total_capital_lower","v":-1210538.5450342253},null,null,"Above £10m","Council","NPV, IRR, MIRR"]
[null,"Total revenue",{"$f":"'4. Output Sheet'!F37","v":1108794.3106132722},{"$f":"'4. Output Sheet'!F109","v":1179394.5798114934},{"$f":"'4. Output Sheet'!F182","v":489760.40628852521}]
[null,"Total expenditure",{"$f":"'4. Output Sheet'!F53","v":-277581.59800521529},{"$f":"'4. Output Sheet'!F125","v":-88907.57642649801},{"$f":"'4. Output Sheet'!F198","v":-102270.9425978153}]
[null,"Operating free cash",{"$f":"'4. Output Sheet'!F59","v":831212.71260805707},{"$f":"'4. Output Sheet'!F131","v":1090487.0033849953},{"$f":"'4. Output Sheet'!F204","v":387489.4636907099}]
[null,"Terminal value",{"$f":"'4. Output Sheet'!F55","v":640042.27209817851},{"$f":"'4. Output Sheet'!F127","v":704046.49930799636},{"$f":"'4. Output Sheet'!F200","v":576038.04488836066}]
[null,"Yield on cash",{"$f":"'4. Output Sheet'!C73","v":7.1005064162000336E-2},{"$f":"'4. Output Sheet'!C145","v":0.18845851951218623},{"$f":"'4. Output Sheet'!C218","v":2.9099705272067716E-2}]
[null,"NPV (£)",{"$f":"'4. Output Sheet'!C67","v":136149.36263495919},{"$f":"'4. Output Sheet'!C139","v":659114.69187680422},{"$f":"'4. Output Sheet'!C212","v":-320730.46247152454}]
[null,"IRR",{"$f":"'4. Output Sheet'!C68","v":0.12960546632400582},{"$f":"'4. Output Sheet'!C140","v":0.3019665837686436},{"$f":"'4. Output Sheet'!C213","v":-6.3248273020104162E-2}]
[null,"MIRR",{"$f":"'4. Output Sheet'!C69","v":9.3133771956797062E-2},{"$f":"'4. Output Sheet'!C141","v":0.17907408762800281},{"$f":"'4. Output Sheet'!C214","v":1.0782596924657328E-2}]
[null,"Payback year",{"$f":"'4. Output Sheet'!F71","v":"6 years 10 months"},{"$f":"'4. Output Sheet'!F143","v":"3 years 8 months"},{"$f":"'4. Output Sheet'!F216","v":"0 years 0 months"}]
[]
[null,"Key assumptions"]
[null,"Construction period (Years)",{"$f":"Year_to_commence_operations_Base","v":1.99},{"$f":"Year_to_commence_operations_upper","v":1.99},{"$f":"Year_to_commence_operations_lower","v":1.99}]
[null,"Refurbishment period (YearS)",{"$f":"Refurbishment_schedule__every_x_years_Base","v":5},{"$f":"Refurbishment_schedule__every_x_years_upper","v":6},{"$f":"Refurbishment_schedule__every_x_years_lower","v":4}]
[null,"Inflation measure",{"$f":"Inflation","v":2.5000000000000001E-2},{"$f":"Inflation","v":2.5000000000000001E-2},{"$f":"Inflation","v":2.5000000000000001E-2}]
[null,"Discount rate",{"$f":"Discount_rate","v":6.5000000000000002E-2},{"$f":"Discount_rate","v":6.5000000000000002E-2},{"$f":"Discount_rate","v":6.5000000000000002E-2}]
[null,"Refurbishment factor applied to all income/expenditure",{"$f":"Refurbishment_factor_Base","v":0.5},{"$f":"Refurbishment_factor_upper","v":0.5},{"$f":"Refurbishment_factor_lower","v":0.5}]
[]
[]
[null,"KPIs",{"$f":"NameofProject","v":"Investment A"},{"$f":"NameofProject","v":"Investment A"},{"$f":"NameofProject","v":"Investment A"}]
[null,null,{"$f":"'3. Input Sheet '!H5","v":"Base Case"},{"$f":"'3. Input Sheet '!I5","v":"Upper Case"},{"$f":"'3. Input Sheet '!J5","v":"Lower Case"}]
[null,"Rental yield",{"$f":"((RentalSpaceIncomeRent_per_sq_ft_Base*RentalSpaceIncomeRental_area__sq_ft_Base)/Terminal_value_Base)*100","v":0.5},{"$f":"((RentalSpaceIncomeRent_per_sq_ft_upper*RentalSpaceIncomeRental_area__sq_ft_upper)/Terminal_value_upper)*100","v":0},{"$f":"((RentalSpaceIncomeRent_per_sq_ft_lower*RentalSpaceIncomeRental_area__sq_ft_lower)/Terminal_value_lower)*100","v":0}]
[null,"Construction period (years)",{"$f":"Number_of_years_for_capex_Base","v":3},{"$f":"Number_of_years_for_capex_upper","v":2},{"$f":"Number_of_years_for_capex_lower","v":4}]
{"$rows_left_out":2}
{"sheet":"2. Model Assumptions","index":3,"n_rows":11,"n_cols":4,"rows_kept":11,"cut":false,"hidden":false,"merged":[]}
[{"$f":"CONCATENATE(\"Support Services Model: \",D6,\" - \",OFFSET(E1,0,Scenario),\"      Generated on: \",TEXT(NOW(),\"dd mmm yy\"))","v":"Support Services Model: Investment A -       Generated on: 04 Aug 17"}]
["Model Assumptions "]
[]
[null,"General Inputs"]
[]
[null,"Name of project",null,"Investment A"]
[]
[null,"Start year (yr 0)",null,2016]
[null,"Number of years (max = )",null,10]
[null,"Inflation",null,2.5000000000000001E-2]
[null,"Discount rate",null,6.5000000000000002E-2]

{"sheet":"3. Input Sheet ","index":4,"n_rows":210,"n_cols":12,"rows_kept":210,"cut":false,"hidden":false,"merged":[]}
[{"$f":"'2. Model Assumptions'!D6&\" Analysis\"","v":"Investment A Analysis"}]
["Input Sheet"]
[]
[null,null,"Scenario",1,null,null,null,1,2,3]
[null,null,null,null,"Unit",null,null,"Base Case","Upper Case","Lower Case",null,"Source"]
[]
["Balance sheet"]
["Initial start up"]
[null,"Initial capital costs",null,{"$f":"OFFSET(G9,0,Scenario)","v":450000},"£",null,null,{"$f":"(H10*H11)+(H10*H12)+H13","v":450000},{"$f":"(I10*I11)+(I10*I12)+I13","v":405000},{"$f":"(J10*J11)+(J10*J12)+J13","v":495000}]
[null,"Total area (sqft)",null,5000,"£",null,null,5000,{"$f":"H10","v":5000},{"$f":"I10","v":5000}]
[null,"Construction costs (£/sq ft)",null,20,"£",null,null,20,{"$f":"H11*0.9","v":18},{"$f":"H11*1.1","v":22}]
[null,"Fit out costs (£/sq ft)",null,10,"£",null,null,10,{"$f":"H12*0.9","v":9},{"$f":"H12*1.1","v":11}]
[null,"Purchase cost",null,300000,"£",null,null,300000,{"$f":"H13*0.9","v":270000},330000]
[null,"Professional fees",null,0,"£",null,null,0,0,0]
[null,"VAT",null,0,"£",null,null,0,0,0]
[null,"Other fees/duties",null,0,"£",null,null,0,0,0]
[null,"Contingency",null,0,"£",null,null,0,0,0]
[null,"Number of years for capex",null,{"$f":"OFFSET(G18,0,Scenario)","v":3},"Years ",null,null,3,2,4]
[null,"Terminal value",null,{"$f":"OFFSET(G19,0,Scenario)","v":500000},"£",null,null,500000,{"$f":"H19*1.1","v":550000},{"$f":"H19*0.9","v":450000}]
[null,"Refurbishment schedule (every x years)",null,{"$f":"OFFSET(G20,0,Scenario)","v":5},"Years ",null,null,5,6,4]
[null,"Refurbishment factor",null,{"$f":"OFFSET(G21,0,Scenario)","v":0.5},"No.",null,null,0.5,0.5,0.5]
[null,"Refurbishment costs (£/sq ft)",null,{"$f":"OFFSET(G22,0,Scenario)","v":50},"£",null,null,50,20,60]
[]
[]
["Income statement"]
[null,"Year to commence operations",null,{"$f":"OFFSET(G26,0,Scenario)-0.01","v":1.98},"Years ",null,null,{"$f":"2-0.01","v":1.99},{"$f":"2-0.01","v":1.99},{"$f":"2-0.01","v":1.99}]
[]
["Revenue generation"]
["Membership income"]
[null,"No of members"]
{"$rows_left_out":181}
{"sheet":"4. Output Sheet","index":5,"n_rows":218,"n_cols":34,"rows_kept":218,"cut":false,"hidden":false,"merged":[]}
[{"$f":"'2. Model Assumptions'!D6&\" Analysis\"","v":"Investment A Analysis"}]
["Output Sheet"]
[]
[{"$f":"CONCATENATE(\"Results generated \",\"on: \",TEXT(NOW(),\"dd mmm yy\"))","v":"Results generated on: 04 Aug 17"}]
[null,"BASE CASE"]
["Year",null,null,"Constant","Units","Total","Sparkline",null,{"$f":"'2. Model Assumptions'!D8","v":2016},{"$f":"IFERROR(IF((J7+$I$6)<($I$6+Number_of_years__max+1),(J7+$I$6),\"\"),\"\")","v":2017},2018,2019,2020,2021,2022,2023,2024,2025,2026,"","","","","","","","","","","","","","",""]
[null,null,null,null,null,null,null,null,0,{"$f":"IFERROR(IF((I7+1)<Number_of_years__max+1,(I7+1),\"\"),\"\")","v":1},2,3,4,5,6,7,8,9,10,"","","","","","","","","","","","","","",""]
[]
[null,"Inflation Index",null,{"$f":"Inflation","v":2.5000000000000001E-2},"%",null,null,null,{"$f":"(1+Inflation)^I7","v":1},1.0249999999999999,1.0506249999999999,1.0768906249999999,1.1038128906249998,1.1314082128906247,1.1596934182128902,1.1886857536682125,1.2184028975099177,1.2488629699476654,1.2800845441963571,{"$error":"#VALUE!"},{"$error":"#VALUE!"},{"$error":"#VALUE!"},{"$error":"#VALUE!"},{"$error":"#VALUE!"},{"$error":"#VALUE!"},{"$error":"#VALUE!"},{"$error":"#VALUE!"},{"$error":"#VALUE!"},{"$error":"#VALUE!"},{"$error":"#VALUE!"},{"$error":"#VALUE!"},{"$error":"#VALUE!"},{"$error":"#VALUE!"},{"$error":"#VALUE!"}]
[]
[null,null,"Refurbishment",null,null,null,null,null,{"$f":"IF(IFERROR(VLOOKUP(I7,'3. Input Sheet '!$H$160:$H$210,1,FALSE),0)>0,\"Yes\",\"No\")","v":"No"},{"$f":"IF(IFERROR(VLOOKUP(J7,'3. Input Sheet '!$H$160:$H$210,1,FALSE),0)>0,\"Yes\",\"No\")","v":"No"},{"$f":"IF(IFERROR(VLOOKUP(K7,'3. Input Sheet '!$H$160:$H$210,1,FALSE),0)>0,\"Yes\",\"No\")","v":"No"},{"$f":"IF(IFERROR(VLOOKUP(L7,'3. Input Sheet '!$H$160:$H$210,1,FALSE),0)>0,\"Yes\",\"No\")","v":"No"},{"$f":"IF(IFERROR(VLOOKUP(M7,'3. Input Sheet '!$H$160:$H$210,1,FALSE),0)>0,\"Yes\",\"No\")","v":"No"},{"$f":"IF(IFERROR(VLOOKUP(N7,'3. Input Sheet '!$H$160:$H$210,1,FALSE),0)>0,\"Yes\",\"No\")","v":"Yes"},{"$f":"IF(IFERROR(VLOOKUP(O7,'3. Input Sheet '!$H$160:$H$210,1,FALSE),0)>0,\"Yes\",\"No\")","v":"No"},{"$f":"IF(IFERROR(VLOOKUP(P7,'3. Input Sheet '!$H$160:$H$210,1,FALSE),0)>0,\"Yes\",\"No\")","v":"No"},{"$f":"IF(IFERROR(VLOOKUP(Q7,'3. Input Sheet '!$H$160:$H$210,1,FALSE),0)>0,\"Yes\",\"No\")","v":"No"},{"$f":"IF(IFERROR(VLOOKUP(R7,'3. Input Sheet '!$H$160:$H$210,1,FALSE),0)>0,\"Yes\",\"No\")","v":"No"},{"$f":"IF(IFERROR(VLOOKUP(S7,'3. Input Sheet '!$H$160:$H$210,1,FALSE),0)>0,\"Yes\",\"No\")","v":"Yes"},{"$f":"IF(IFERROR(VLOOKUP(T7,'3. Input Sheet '!$H$160:$H$210,1,FALSE),0)>0,\"Yes\",\"No\")","v":"Yes"},{"$f":"IF(IFERROR(VLOOKUP(U7,'3. Input Sheet '!$H$160:$H$210,1,FALSE),0)>0,\"Yes\",\"No\")","v":"Yes"},{"$f":"IF(IFERROR(VLOOKUP(V7,'3. Input Sheet '!$H$160:$H$210,1,FALSE),0)>0,\"Yes\",\"No\")","v":"Yes"},{"$f":"IF(IFERROR(VLOOKUP(W7,'3. Input Sheet '!$H$160:$H$210,1,FALSE),0)>0,\"Yes\",\"No\")","v":"Yes"},{"$f":"IF(IFERROR(VLOOKUP(X7,'3. Input Sheet '!$H$160:$H$210,1,FALSE),0)>0,\"Yes\",\"No\")","v":"Yes"},{"$f":"IF(IFERROR(VLOOKUP(Y7,'3. Input Sheet '!$H$160:$H$210,1,FALSE),0)>0,\"Yes\",\"No\")","v":"Yes"},{"$f":"IF(IFERROR(VLOOKUP(Z7,'3. Input Sheet '!$H$160:$H$210,1,FALSE),0)>0,\"Yes\",\"No\")","v":"Yes"},{"$f":"IF(IFERROR(VLOOKUP(AA7,'3. Input Sheet '!$H$160:$H$210,1,FALSE),0)>0,\"Yes\",\"No\")","v":"Yes"},{"$f":"IF(IFERROR(VLOOKUP(AB7,'3. Input Sheet '!$H$160:$H$210,1,FALSE),0)>0,\"Yes\",\"No\")","v":"Yes"},{"$f":"IF(IFERROR(VLOOKUP(AC7,'3. Input Sheet '!$H$160:$H$210,1,FALSE),0)>0,\"Yes\",\"No\")","v":"Yes"},{"$f":"IF(IFERROR(VLOOKUP(AD7,'3. Input Sheet '!$H$160:$H$210,1,FALSE),0)>0,\"Yes\",\"No\")","v":"Yes"},{"$f":"IF(IFERROR(VLOOKUP(AE7,'3. Input Sheet '!$H$160:$H$210,1,FALSE),0)>0,\"Yes\",\"No\")","v":"Yes"},{"$f":"IF(IFERROR(VLOOKUP(AF7,'3. Input Sheet '!$H$160:$H$210,1,FALSE),0)>0,\"Yes\",\"No\")","v":"Yes"},{"$f":"IF(IFERROR(VLOOKUP(AG7,'3. Input Sheet '!$H$160:$H$210,1,FALSE),0)>0,\"Yes\",\"No\")","v":"Yes"},{"$f":"IF(IFERROR(VLOOKUP(AH7,'3. Input Sheet '!$H$160:$H$210,1,FALSE),0)>0,\"Yes\",\"No\")","v":"Yes"}]
[null,null,"Refurbishment factor",null,null,null,null,null,{"$f":"IF(I11=\"No\",1,Refurbishment_factor_Base)","v":1},1,1,1,1,0.5,1,1,1,1,0.5,0.5,0.5,0.5,0.5,0.5,0.5,0.5,0.5,0.5,0.5,0.5,0.5,0.5,0.5,0.5]
[]
["Balance sheet"]
[null,"Capital "]
[null,null,"Initial capital cost",null,"£",{"$f":"SUM(I16:AH16)","v":-461343.75},null,null,{"$f":"IFERROR(IF(I7<Number_of_years_for_capex_Base,-InitialcapitalcostsBase/Number_of_years_for_capex_Base*I9,\"\"),0)","v":-150000},-153750,-157593.75,"","","","","","","","","","","","","","","","","","","","","","",""]
[null,null,{"$f":"'[1]Input Sheet'!$C$14","v":"Professional fees"},null,"£",{"$f":"SUM(I17:AH17)","v":0},null,null,{"$f":"IFERROR(IF(I7<Number_of_years_for_capex_Base,-Professional_fees_Base/Number_of_years_for_capex_Base*I9,\"\"),0)","v":0},0,0,"","","","","","","","","","","","","","","","","","","","","","",""]
[null,null,{"$f":"'[1]Input Sheet'!$C$15","v":"VAT"},null,"£",0,null,null,{"$f":"IFERROR(IF(I7<Number_of_years_for_capex_Base,-VAT_Base/Number_of_years_for_capex_Base*I9,\"\"),0)","v":0},0,0,"","","","","","","","","","","","","","","","","","","","","","",""]
[null,null,{"$f":"'[1]Input Sheet'!$C$16","v":"Other fees/duties"},null,"£",0,null,null,{"$f":"IFERROR(IF(I9<Number_of_years_for_capex_Base,-Other_fees_duties_Base/Number_of_years_for_capex_Base*I11,\"\"),0)","v":0},0,0,0,0,0,0,0,0,0,0,0,0,0,0,0,0,0,0,0,0,0,0,0,0,0]
[null,null,{"$f":"'[1]Input Sheet'!$C$17","v":"Contingency"},null,"£",0,null,null,{"$f":"IFERROR(IF(I10<Number_of_years_for_capex_Base,-Contingency_Base/Number_of_years_for_capex_Base*I12,\"\"),0)","v":0},0,0,0,0,0,0,0,0,0,0,0,0,0,0,0,0,0,0,0,0,0,0,0,0,0]
[null,null,"Refurbishment",null,"£",-602873.1892717455,null,null,{"$f":"IFERROR(IF(AND(I11=\"Yes\",I7>1),-Refurbishment_costs_sq_ft_Base*Totalarea_sqft_Base*I9,0),0)","v":0},0,0,0,0,-282852.05322265619,0,0,0,0,-320021.13604908925,0,0,0,0,0,0,0,0,0,0,0,0,0,0,0]
[]
["Total capital",null,null,null,"£",{"$f":"SUM(I23:AH23)","v":-1064216.9392717455},null,null,{"$f":"SUM(I16:I21)","v":-150000},-153750,-157593.75,0,0,-282852.05322265619,0,0,0,0,-320021.13604908925,0,0,0,0,0,0,0,0,0,0,0,0,0,0,0]
[]
["Cash Flow Statement"]
["Income Statement"]
[null,"Revenue"]
[null,null,{"$f":"'[1]Input Sheet'!$B$28","v":"Membership income"},null,"£",{"$f":"SUM(I28:AH28)","v":586015.6343701171},null,null,{"$f":"IFERROR(IF(I7>Year_to_commence_operations_Base,(VLOOKUP(I7,'3. Input Sheet '!$C$31:$H$80,6,FALSE)*I9*Membership_rate_per_annum_Base)*I12,\"\"),0)","v":""},{"$f":"IFERROR(IF(J7>Year_to_commence_operations_Base,(VLOOKUP(J7,'3. Input Sheet '!$C$31:$H$80,6,FALSE)*J9*Membership_rate_per_annum_Base)*J12,\"\"),0)","v":""},{"$f":"IFERROR(IF(K7>Year_to_commence_operations_Base,(VLOOKUP(K7,'3. Input Sheet '!$C$31:$H$80,6,FALSE)*K9*Membership_rate_per_annum_Base)*K12,\"\"),0)","v":63037.5},{"$f":"IFERROR(IF(L7>Year_to_commence_operations_Base,(VLOOKUP(L7,'3. Input Sheet '!$C$31:$H$80,6,FALSE)*L9*Membership_rate_per_annum_Base)*L12,\"\"),0)","v":96920.156249999985},{"$f":"IFERROR(IF(M7>Year_to_commence_operations_Base,(VLOOKUP(M7,'3. Input Sheet '!$C$31:$H$80,6,FALSE)*M9*Membership_rate_per_annum_Base)*M12,\"\"),0)","v":132457.54687499997},{"$f":"IFERROR(IF(N7>Year_to_commence_operations_Base,(VLOOKUP(N7,'3. Input Sheet '!$C$31:$H$80,6,FALSE)*N9*Membership_rate_per_annum_Base)*N12,\"\"),0)","v":84855.61596679686},{"$f":"IFERROR(IF(O7>Year_to_commence_operations_Base,(VLOOKUP(O7,'3. Input Sheet '!$C$31:$H$80,6,FALSE)*O9*Membership_rate_per_annum_Base)*O12,\"\"),0)","v":208744.81527832025},{"$f":"IFERROR(IF(P7>Year_to_commence_operations_Base,(VLOOKUP(P7,'3. Input Sheet '!$C$31:$H$80,6,FALSE)*P9*Membership_rate_per_annum_Base)*P12,\"\"),0)","v":0},{"$f":"IFERROR(IF(Q7>Year_to_commence_operations_Base,(VLOOKUP(Q7,'3. Input Sheet '!$C$31:$H$80,6,FALSE)*Q9*Membership_rate_per_annum_Base)*Q12,\"\"),0)","v":0},{"$f":"IFERROR(IF(R7>Year_to_commence_operations_Base,(VLOOKUP(R7,'3. Input Sheet '!$C$31:$H$80,6,FALSE)*R9*Membership_rate_per_annum_Base)*R12,\"\"),0)","v":0},{"$f":"IFERROR(IF(S7>Year_to_commence_operations_Base,(VLOOKUP(S7,'3. Input Sheet '!$C$31:$H$80,6,FALSE)*S9*Membership_rate_per_annum_Base)*S12,\"\"),0)","v":0},{"$f":"IFERROR(IF(T7>Year_to_commence_operations_Base,(VLOOKUP(T7,'3. Input Sheet '!$C$31:$H$80,6,FALSE)*T9*Membership_rate_per_annum_Base)*T12,\"\"),0)","v":0},{"$f":"IFERROR(IF(U7>Year_to_commence_operations_Base,(VLOOKUP(U7,'3. Input Sheet '!$C$31:$H$80,6,FALSE)*U9*Membership_rate_per_annum_Base)*U12,\"\"),0)","v":0},{"$f":"IFERROR(IF(V7>Year_to_commence_operations_Base,(VLOOKUP(V7,'3. Input Sheet '!$C$31:$H$80,6,FALSE)*V9*Membership_rate_per_annum_Base)*V12,\"\"),0)","v":0},{"$f":"IFERROR(IF(W7>Year_to_commence_operations_Base,(VLOOKUP(W7,'3. Input Sheet '!$C$31:$H$80,6,FALSE)*W9*Membership_rate_per_annum_Base)*W12,\"\"),0)","v":0},{"$f":"IFERROR(IF(X7>Year_to_commence_operations_Base,(VLOOKUP(X7,'3. Input Sheet '!$C$31:$H$80,6,FALSE)*X9*Membership_rate_per_annum_Base)*X12,\"\"),0)","v":0},{"$f":"IFERROR(IF(Y7>Year_to_commence_operations_Base,(VLOOKUP(Y7,'3. Input Sheet '!$C$31:$H$80,6,FALSE)*Y9*Membership_rate_per_annum_Base)*Y12,\"\"),0)","v":0},{"$f":"IFERROR(IF(Z7>Year_to_commence_operations_Base,(VLOOKUP(Z7,'3. Input Sheet '!$C$31:$H$80,6,FALSE)*Z9*Membership_rate_per_annum_Base)*Z12,\"\"),0)","v":0},{"$f":"IFERROR(IF(AA7>Year_to_commence_operations_Base,(VLOOKUP(AA7,'3. Input Sheet '!$C$31:$H$80,6,FALSE)*AA9*Membership_rate_per_annum_Base)*AA12,\"\"),0)","v":0},{"$f":"IFERROR(IF(AB7>Year_to_commence_operations_Base,(VLOOKUP(AB7,'3. Input Sheet '!$C$31:$H$80,6,FALSE)*AB9*Membership_rate_per_annum_Base)*AB12,\"\"),0)","v":0},{"$f":"IFERROR(IF(AC7>Year_to_commence_operations_Base,(VLOOKUP(AC7,'3. Input Sheet '!$C$31:$H$80,6,FALSE)*AC9*Membership_rate_per_annum_Base)*AC12,\"\"),0)","v":0},{"$f":"IFERROR(IF(AD7>Year_to_commence_operations_Base,(VLOOKUP(AD7,'3. Input Sheet '!$C$31:$H$80,6,FALSE)*AD9*Membership_rate_per_annum_Base)*AD12,\"\"),0)","v":0},{"$f":"IFERROR(IF(AE7>Year_to_commence_operations_Base,(VLOOKUP(AE7,'3. Input Sheet '!$C$31:$H$80,6,FALSE)*AE9*Membership_rate_per_annum_Base)*AE12,\"\"),0)","v":0},{"$f":"IFERROR(IF(AF7>Year_to_commence_operations_Base,(VLOOKUP(AF7,'3. Input Sheet '!$C$31:$H$80,6,FALSE)*AF9*Membership_rate_per_annum_Base)*AF12,\"\"),0)","v":0},{"$f":"IFERROR(IF(AG7>Year_to_commence_operations_Base,(VLOOKUP(AG7,'3. Input Sheet '!$C$31:$H$80,6,FALSE)*AG9*Membership_rate_per_annum_Base)*AG12,\"\"),0)","v":0},{"$f":"IFERROR(IF(AH7>Year_to_commence_operations_Base,(VLOOKUP(AH7,'3. Input Sheet '!$C$31:$H$80,6,FALSE)*AH9*Membership_rate_per_annum_Base)*AH12,\"\"),0)","v":0}]
[null,null,{"$f":"'[1]Input Sheet'!$C$84","v":"Accommodation income"},null,"£",499646.87640938745,null,null,{"$f":"IFERROR(IF(I7>Year_to_commence_operations_Base,AccommodationNumber_of_rooms_Base*AccommodationPrice_per_night_Base*AccommodationNights_in_operation_Base*AccommodationOccupancy_Base*I9*I12,\"\"),0)","v":""},"",56733.749999999993,58152.093749999993,59605.896093749987,30548.021748046867,62623.444583496072,64189.030698083472,65793.756465535553,67438.600377173934,34562.28269330164,0,0,0,0,0,0,0,0,0,0,0,0,0,0,0]
[null,null,{"$f":"'[1]Input Sheet'!$C$90","v":"Rental space income"},null,"£",23131.799833767942,null,null,{"$f":"IFERROR(IF(I7>Year_to_commence_operations_Base,RentalSpaceIncomeRent_per_sq_ft_Base*RentalSpaceIncomeRental_area__sq_ft_Base*I9*I12,\"\"),0)","v":""},"",2626.5625,2692.2265624999995,2759.5322265624995,1414.2602661132807,2899.2335455322254,2971.714384170531,3046.0072437747945,3122.1574248691636,1600.1056802454464,0,0,0,0,0,0,0,0,0,0,0,0,0,0,0]
{"$rows_left_out":189}
{"sheet":"5. Notes","index":6,"n_rows":16,"n_cols":2,"rows_kept":16,"cut":false,"hidden":false,"merged":[]}
[]
[]
[]
[]
[]
[null,"5. NOTES"]
[]
[null,"- To include any additional information/calculations here"]
[]
[null,"Please note clearly where you have made any changes to the model (if any)"]
[]
[null,"Key assumptions "]
[null,"Please be explicit about the base assumptions used to any changes/additional information provided. "]
[]
[null,"Risks "]
[null,"If there are any risks or uncertainty associated with the project and (if any) mitigating actions . "]